{"text_format":"1","workbook":"xlsx","n_sheets":6,"sheets":["異動届出書（様式）","①特→普（記載例）","②特→特（記載例）","　　","異動届出書（リスト印刷）","入力リスト"],"not_rendered":{"charts":0,"images":0,"macros":1,"external_links":0,"defined_names":4,"comments":0,"pivot_tables":0},"unopened":[],"bounds":{"document_bytes":16777216,"sheet_cells":100000,"rows_first":2000,"rows_last":500,"rows_between":2000,"halvings":0,"cell_chars":16384,"cell_head_chars":4096},"cells_cut":0,"cells_raw":0,"read":"whole","date_system":"1900"}

{"sheet":"異動届出書（様式）","index":0,"n_rows":60,"n_cols":83,"rows_kept":60,"cut":false,"hidden":false,"merged":[[0,0,59,0],[0,2,2,17],[0,18,2,52],[0,53,2,58],[0,59,2,90],[3,1,8,10],[3,11,4,12],[3,13,12,14],[3,15,5,22],[3,23,3,24],[3,26,3,52],[3,53,12,54],[3,55,5,58],[3,59,5,73],[3,74,4,90],[4,23,5,52],[10,36,12,37],[10,38,12,40],[10,41,12,42],[10,43,12,44],[5,74,6,90],[6,15,7,22],[6,23,7,52],[6,55,9,58],[6,59,9,73],[7,74,12,90],[8,15,9,22],[8,23,9,52],[10,34,12,35],[10,45,12,47],[10,48,12,48],[10,49,12,50],[10,51,12,52],[10,55,12,58],[10,59,12,73],[33,30,35,37],[33,38,35,45],[33,46,35,52],[9,1,10,10],[10,15,12,22],[10,23,12,25],[10,26,12,28],[10,29,12,30],[10,31,12,33],[11,1,12,10],[11,11,12,12],[5,11,10,12],[21,60,22,60],[21,61,22,69],[21,71,22,81],[23,2,25,6],[23,7,25,8],[23,9,25,9],[23,10,25,11],[23,12,25,13],[23,14,25,15],[23,16,25,17],[20,19,22,20],[20,21,22,23],[20,24,22,26],[20,2,22,6],[20,7,22,13],[20,14,22,16],[20,17,22,18],[20,27,22,29],[19,73,20,81],[13,53,17,59],[13,60,17,69],[13,70,17,81],[13,82,17,90],[15,2,19,6],[15,7,19,29],[18,53,19,59],[18,60,18,69],[18,70,18,81],[13,2,14,6],[13,7,14,29],[13,30,17,37],[13,38,17,45],[13,46,17,52],[20,53,20,59],[21,38,24,38],[21,46,24,46],[21,54,24,57],[21,58,24,59],[23,18,25,19],[19,39,22,41],[19,42,22,45],[19,47,22,49],[19,50,22,52],[18,30,32,37],[29,38,32,45],[29,46,32,52],[26,7,28,29],[26,54,30,57],[26,58,30,59],[27,60,28,60],[27,61,28,69],[29,2,32,6],[29,7,32,29],[25,60,26,60],[25,61,26,69],[29,60,30,60],[29,61,30,69],[24,39,27,41],[24,42,27,45],[24,47,27,49],[24,50,27,52],[23,20,25,20],[23,21,25,23],[23,24,25,24],[23,25,25,27],[23,28,25,29],[23,53,29,53],[32,58,34,59],[33,2,35,6],[26,2,28,6],[33,7,35,29],[29,70,30,81],[30,82,35,90],[31,53,34,53],[31,54,31,59],[31,60,32,60],[31,61,32,69],[31,70,32,70],[31,71,32,72],[31,73,32,81],[32,54,34,57],[24,82,29,90],[25,54,25,59],[25,70,27,70],[25,71,26,72],[25,73,26,81],[27,71,28,81],[23,60,24,60],[23,61,24,69],[23,70,24,81],[18,82,23,90],[19,60,20,60],[19,61,20,69],[19,70,22,70],[19,71,20,72],[33,61,33,69],[33,70,33,72],[33,73,33,81],[34,60,35,69],[34,71,35,81],[35,53,35,59],[36,1,36,90],[37,1,42,1],[37,2,37,6],[37,30,37,35],[37,36,37,37],[37,38,37,40],[37,41,37,42],[37,43,37,44],[37,45,37,47],[40,62,41,73],[40,74,41,90],[41,2,42,6],[41,7,42,44],[41,48,42,50],[41,51,42,61],[42,62,42,73],[42,74,42,90],[13,1,35,1],[37,62,39,90],[38,2,39,6],[38,7,39,44],[38,45,42,47],[38,48,38,50],[38,51,38,61],[39,48,40,50],[39,51,40,61],[40,2,40,6],[40,7,40,44],[37,49,37,50],[37,51,37,52],[37,53,37,54],[37,55,37,56],[37,57,37,58],[37,60,37,61],[37,7,37,21],[37,22,37,29],[51,1,51,90],[52,1,58,1],[52,2,58,57],[52,58,58,59],[52,60,58,74],[43,1,43,90],[44,1,50,1],[44,2,50,44],[44,45,45,52],[44,53,45,63],[44,64,50,90],[46,45,50,52],[46,53,50,63]]}
[null,null,"給与支払報告\n特別徴収",null,null,null,null,null,null,null,null,null,null,null,null,null,null,null,"　に係る給与所得者異動届出書",null,null,null,null,null,null,null,null,null,null,null,null,null,null,null,null,null,null,null,null,null,null,null,null,null,null,null,null,null,null,null,null,null,null,"年度",null,null,null,null,null," 　1.現年度　　　2.新年度　　　3.両年度"]
[]
[]
[null,"佐 伯 市 長 様",null,null,null,null,null,null,null,null,null,"\n",null,"（特別徴収義務者）",null,"所在地",null,null,null,null,null,null,null,"〒",null,null,null,null,null,null,null,null,null,null,null,null,null,null,null,null,null,null,null,null,null,null,null,null,null,null,null,null,null,"担当者連絡先",null,"所属",null,null,null,null,null,null,null,null,null,null,null,null,null,null,null,null,null,null,"特別徴収義務者指定番号"]
[]
[null,null,null,null,null,null,null,null,null,null,null,"給与支払者"]
[null,null,null,null,null,null,null,null,null,null,null,null,null,null,null,"フリガナ",null,null,null,null,null,null,null,null,null,null,null,null,null,null,null,null,null,null,null,null,null,null,null,null,null,null,null,null,null,null,null,null,null,null,null,null,null,null,null,"氏名"]
[null,null,null,null,null,null,null,null,null,null,null,null,null,null,null,null,null,null,null,null,null,null,null,null,null,null,null,null,null,null,null,null,null,null,null,null,null,null,null,null,null,null,null,null,null,null,null,null,null,null,null,null,null,null,null,null,null,null,null,null,null,null,null,null,null,null,null,null,null,null,null,null,null,null,"〔市受付）"]
[null,null,null,null,null,null,null,null,null,null,null,null,null,null,null,"氏名又は名称"]
[null,"令和   年   月   日提出"]
[null,null,null,null,null,null,null,null,null,null,null,null,null,null,null,"個人番号\n又は法人番号",null,null,null,null,null,null,null,null,null,null,null,null,null,null,null,null,null,null,null,null,null,null,null,null,null,null,null,null,null,null,null,null,null,null,null,null,null,null,null,"電話",null,null,null,"  内線（　　　　）"]
[]
[]
[null,"給与所得者","フリガナ",null,null,null,null,null,null,null,null,null,null,null,null,null,null,null,null,null,null,null,null,null,null,null,null,null,null,null,"(ア)\n特別徴収税額\n（年税額）",null,null,null,null,null,null,null,"(イ)\n徴収済額",null,null,null,null,null,null,null,"(ウ)\n未徴収税額\n(ア)－(イ)",null,null,null,null,null,null,"異　動\n年月日",null,null,null,null,null,null,"異動の事由",null,null,null,null,null,null,null,null,null,"異動後の未徴収\n税額の徴収方法",null,null,null,null,null,null,null,null,null,null,null,"退職時までの\n給与支払額\n(1月1日以降)"]
[]
{"$rows_left_out":46}
{"sheet":"①特→普（記載例）","index":1,"n_rows":63,"n_cols":83,"rows_kept":63,"cut":false,"hidden":false,"merged":[[1,0,62,0],[1,2,3,17],[1,18,3,52],[1,53,3,58],[1,59,3,90],[4,1,9,10],[4,11,5,12],[4,13,13,14],[4,15,6,22],[4,23,4,24],[4,26,4,52],[4,53,13,54],[4,55,6,58],[4,59,6,73],[4,74,5,90],[5,23,6,52],[11,36,13,37],[11,38,13,40],[11,41,13,42],[11,43,13,44],[6,74,7,90],[7,15,8,22],[7,23,8,52],[7,55,10,58],[7,59,10,73],[8,74,13,90],[9,15,10,22],[9,23,10,52],[11,34,13,35],[11,45,13,47],[11,48,13,48],[11,49,13,50],[11,51,13,52],[11,55,13,58],[11,59,13,73],[10,1,11,10],[11,15,13,22],[11,23,13,25],[11,26,13,28],[11,29,13,30],[11,31,13,33],[12,1,13,10],[12,11,13,12],[6,11,11,12],[16,1,38,1],[16,2,17,6],[16,7,17,29],[16,30,20,37],[16,38,20,45],[16,46,20,52],[23,2,25,6],[23,7,25,13],[23,14,25,16],[23,17,25,18],[23,27,25,29],[29,2,31,6],[29,7,31,29],[22,73,23,81],[16,53,20,59],[16,60,20,69],[16,70,20,81],[16,82,20,90],[18,2,22,6],[18,7,22,29],[21,30,35,37],[21,53,22,59],[21,60,21,69],[21,70,21,81],[24,60,25,60],[24,61,25,69],[24,71,25,81],[26,2,28,6],[26,7,28,8],[26,9,28,9],[26,10,28,11],[26,12,28,13],[26,14,28,15],[26,16,28,17],[23,19,25,20],[23,21,25,23],[23,24,25,26],[23,53,23,59],[24,38,27,38],[24,46,27,46],[24,54,27,57],[24,58,27,59],[26,18,28,19],[22,39,25,41],[22,42,25,45],[22,47,25,49],[22,50,25,52],[29,54,33,57],[29,58,33,59],[30,60,31,60],[30,61,31,69],[32,2,35,6],[32,7,35,29],[32,38,35,45],[32,46,35,52],[28,60,29,60],[28,61,29,69],[32,60,33,60],[32,61,33,69],[27,39,30,41],[27,42,30,45],[27,47,30,49],[27,50,30,52],[26,20,28,20],[26,21,28,23],[26,24,28,24],[26,25,28,27],[26,28,28,29],[26,53,32,53],[32,70,33,81],[33,82,38,90],[34,53,37,53],[34,54,34,59],[34,60,35,60],[34,61,35,69],[34,70,35,70],[34,71,35,72],[34,73,35,81],[35,54,37,57],[27,82,32,90],[28,54,28,59],[28,70,30,70],[28,71,29,72],[28,73,29,81],[30,71,31,81],[26,60,27,60],[26,61,27,69],[26,70,27,81],[21,82,26,90],[22,60,23,60],[22,61,23,69],[22,70,25,70],[22,71,23,72],[36,61,36,69],[36,70,36,72],[36,73,36,81],[37,60,38,69],[37,71,38,81],[38,53,38,59],[35,58,37,59],[36,2,38,6],[36,7,38,29],[36,30,38,37],[36,38,38,45],[36,46,38,52],[39,1,39,90],[40,1,45,1],[40,2,40,6],[40,7,40,21],[40,22,40,29],[40,30,40,35],[40,36,40,37],[40,38,40,40],[40,41,40,42],[40,43,40,44],[40,60,40,61],[40,62,42,90],[41,2,42,6],[41,7,42,44],[41,45,45,47],[41,48,41,50],[41,51,41,61],[42,48,43,50],[42,51,43,61],[43,2,43,6],[40,45,40,47],[40,49,40,50],[40,51,40,52],[40,53,40,54],[40,55,40,56],[40,57,40,58],[43,7,43,44],[43,62,44,73],[43,74,44,90],[44,2,45,6],[44,7,45,44],[44,48,45,50],[44,51,45,61],[45,62,45,73],[45,74,45,90],[54,1,54,90],[55,1,61,1],[55,2,61,57],[55,58,61,59],[55,60,61,74],[46,1,46,90],[47,1,53,1],[47,2,53,44],[47,45,48,52],[47,53,48,63],[47,64,53,90],[49,45,53,52],[49,53,53,63]]}
[]
[null,null,"給与支払報告\n特別徴収",null,null,null,null,null,null,null,null,null,null,null,null,null,null,null,"　に係る給与所得者異動届出書",null,null,null,null,null,null,null,null,null,null,null,null,null,null,null,null,null,null,null,null,null,null,null,null,null,null,null,null,null,null,null,null,null,null,"年度",null,null,null,null,null," 　1.現年度　　　2.新年度　　　3.両年度"]
[]
[]
[null,"佐 伯 市 長 様",null,null,null,null,null,null,null,null,null,"\n",null,"（特別徴収義務者）",null,"所在地",null,null,null,null,null,null,null,"〒",null,null,"876-0000",null,null,null,null,null,null,null,null,null,null,null,null,null,null,null,null,null,null,null,null,null,null,null,null,null,null,"担当者連絡先",null,"所属",null,null,null,"総務係",null,null,null,null,null,null,null,null,null,null,null,null,null,null,"特別徴収義務者指定番号"]
[null,null,null,null,null,null,null,null,null,null,null,null,null,null,null,null,null,null,null,null,null,null,null,"佐伯市中村南町99番1号"]
[null,null,null,null,null,null,null,null,null,null,null,"給与支払者",null,null,null,null,null,null,null,null,null,null,null,null,null,null,null,null,null,null,null,null,null,null,null,null,null,null,null,null,null,null,null,null,null,null,null,null,null,null,null,null,null,null,null,null,null,null,null,null,null,null,null,null,null,null,null,null,null,null,null,null,null,null,9000111]
[null,null,null,null,null,null,null,null,null,null,null,null,null,null,null,"フリガナ",null,null,null,null,null,null,null,"オオイタショウジ",null,null,null,null,null,null,null,null,null,null,null,null,null,null,null,null,null,null,null,null,null,null,null,null,null,null,null,null,null,null,null,"氏名",null,null,null,"上浦　好子"]
[null,null,null,null,null,null,null,null,null,null,null,null,null,null,null,null,null,null,null,null,null,null,null,null,null,null,null,null,null,null,null,null,null,null,null,null,null,null,null,null,null,null,null,null,null,null,null,null,null,null,null,null,null,null,null,null,null,null,null,null,null,null,null,null,null,null,null,null,null,null,null,null,null,null,"〔市受付）"]
[null,null,null,null,null,null,null,null,null,null,null,null,null,null,null,"氏名又は名称",null,null,null,null,null,null,null,"株式会社　大分商事"]
[null,"令和 6 年 12 月 1 日提出"]
[null,null,null,null,null,null,null,null,null,null,null,null,null,null,null,"個人番号\n又は法人番号",null,null,null,null,null,null,null,8,null,null,7,null,null,6,null,5,null,null,4,null,3,null,2,null,null,1,null,2,null,3,null,null,4,5,null,6,null,null,null,"電話",null,null,null,"0972-22-3111   内線（　　　　）"]
[]
[]
[]
{"$rows_left_out":49}
{"sheet":"②特→特（記載例）","index":2,"n_rows":63,"n_cols":83,"rows_kept":63,"cut":false,"hidden":false,"merged":[[1,0,62,0],[1,2,3,17],[1,18,3,52],[1,53,3,58],[1,59,3,90],[4,1,9,10],[4,11,5,12],[4,13,13,14],[4,15,6,22],[4,23,4,24],[4,26,4,52],[4,53,13,54],[4,55,6,58],[4,59,6,73],[4,74,5,90],[5,23,6,52],[11,36,13,37],[11,38,13,40],[11,41,13,42],[11,43,13,44],[6,74,7,90],[7,15,8,22],[7,23,8,52],[7,55,10,58],[7,59,10,73],[8,74,13,90],[9,15,10,22],[9,23,10,52],[11,34,13,35],[11,45,13,47],[11,48,13,48],[11,49,13,50],[11,51,13,52],[11,55,13,58],[11,59,13,73],[10,1,11,10],[11,15,13,22],[11,23,13,25],[11,26,13,28],[11,29,13,30],[11,31,13,33],[12,1,13,10],[12,11,13,12],[6,11,11,12],[16,1,38,1],[16,2,17,6],[16,7,17,29],[16,30,20,37],[16,38,20,45],[16,46,20,52],[23,2,25,6],[23,7,25,13],[23,14,25,16],[23,17,25,18],[23,27,25,29],[29,2,31,6],[29,7,31,29],[22,73,23,81],[16,53,20,59],[16,60,20,69],[16,70,20,81],[16,82,20,90],[18,2,22,6],[18,7,22,29],[21,30,35,37],[21,53,22,59],[21,60,21,69],[21,70,21,81],[24,60,25,60],[24,61,25,69],[24,71,25,81],[26,2,28,6],[26,7,28,8],[26,9,28,9],[26,10,28,11],[26,12,28,13],[26,14,28,15],[26,16,28,17],[23,19,25,20],[23,21,25,23],[23,24,25,26],[23,53,23,59],[24,38,27,38],[24,46,27,46],[24,54,27,57],[24,58,27,59],[26,18,28,19],[22,39,25,41],[22,42,25,45],[22,47,25,49],[22,50,25,52],[29,54,33,57],[29,58,33,59],[30,60,31,60],[30,61,31,69],[32,2,35,6],[32,7,35,29],[32,38,35,45],[32,46,35,52],[28,60,29,60],[28,61,29,69],[32,60,33,60],[32,61,33,69],[27,39,30,41],[27,42,30,45],[27,47,30,49],[27,50,30,52],[26,20,28,20],[26,21,28,23],[26,24,28,24],[26,25,28,27],[26,28,28,29],[26,53,32,53],[32,70,33,81],[33,82,38,90],[34,53,37,53],[34,54,34,59],[34,60,35,60],[34,61,35,69],[34,70,35,70],[34,71,35,72],[34,73,35,81],[35,54,37,57],[27,82,32,90],[28,54,28,59],[28,70,30,70],[28,71,29,72],[28,73,29,81],[30,71,31,81],[26,60,27,60],[26,61,27,69],[26,70,27,81],[21,82,26,90],[22,60,23,60],[22,61,23,69],[22,70,25,70],[22,71,23,72],[36,61,36,69],[36,70,36,72],[36,73,36,81],[37,60,38,69],[37,71,38,81],[38,53,38,59],[35,58,37,59],[36,2,38,6],[36,7,38,29],[36,30,38,37],[36,38,38,45],[36,46,38,52],[39,1,39,90],[40,1,45,1],[40,2,40,6],[40,7,40,21],[40,22,40,29],[40,30,40,35],[40,36,40,37],[40,38,40,40],[40,41,40,42],[40,43,40,44],[40,60,40,61],[40,62,42,90],[41,2,42,6],[41,7,42,44],[41,45,45,47],[41,48,41,50],[41,51,41,61],[42,48,43,50],[42,51,43,61],[43,2,43,6],[40,45,40,47],[40,49,40,50],[40,51,40,52],[40,53,40,54],[40,55,40,56],[40,57,40,58],[43,7,43,44],[43,62,44,73],[43,74,44,90],[44,2,45,6],[44,7,45,44],[44,48,45,50],[44,51,45,61],[45,62,45,73],[45,74,45,90],[54,1,54,90],[55,1,61,1],[55,2,61,57],[55,58,61,59],[55,60,61,74],[46,1,46,90],[47,1,53,1],[47,2,53,44],[47,45,48,52],[47,53,48,63],[47,64,53,90],[49,45,53,52],[49,53,53,63]]}
[]
[null,null,"給与支払報告\n特別徴収",null,null,null,null,null,null,null,null,null,null,null,null,null,null,null,"　に係る給与所得者異動届出書",null,null,null,null,null,null,null,null,null,null,null,null,null,null,null,null,null,null,null,null,null,null,null,null,null,null,null,null,null,null,null,null,null,null,"年度",null,null,null,null,null," 　1.現年度　　　2.新年度　　　3.両年度"]
[]
[]
[null,"佐 伯 市 長 様",null,null,null,null,null,null,null,null,null,"\n",null,"（特別徴収義務者）",null,"所在地",null,null,null,null,null,null,null,"〒",null,null,"876-0000",null,null,null,null,null,null,null,null,null,null,null,null,null,null,null,null,null,null,null,null,null,null,null,null,null,null,"担当者連絡先",null,"所属",null,null,null,"経理課",null,null,null,null,null,null,null,null,null,null,null,null,null,null,"特別徴収義務者指定番号"]
[null,null,null,null,null,null,null,null,null,null,null,null,null,null,null,null,null,null,null,null,null,null,null,"佐伯市中村北町100番99号"]
[null,null,null,null,null,null,null,null,null,null,null,"給与支払者",null,null,null,null,null,null,null,null,null,null,null,null,null,null,null,null,null,null,null,null,null,null,null,null,null,null,null,null,null,null,null,null,null,null,null,null,null,null,null,null,null,null,null,null,null,null,null,null,null,null,null,null,null,null,null,null,null,null,null,null,null,null,80001234]
[null,null,null,null,null,null,null,null,null,null,null,null,null,null,null,"フリガナ",null,null,null,null,null,null,null,"サイキショウテン",null,null,null,null,null,null,null,null,null,null,null,null,null,null,null,null,null,null,null,null,null,null,null,null,null,null,null,null,null,null,null,"氏名",null,null,null,"直川　次郎"]
[null,null,null,null,null,null,null,null,null,null,null,null,null,null,null,null,null,null,null,null,null,null,null,null,null,null,null,null,null,null,null,null,null,null,null,null,null,null,null,null,null,null,null,null,null,null,null,null,null,null,null,null,null,null,null,null,null,null,null,null,null,null,null,null,null,null,null,null,null,null,null,null,null,null,"〔市受付）"]
[null,null,null,null,null,null,null,null,null,null,null,null,null,null,null,"氏名又は名称",null,null,null,null,null,null,null,"有限会社　さいき商店"]
[null,"令和 6 年 12 月 1 日提出"]
[null,null,null,null,null,null,null,null,null,null,null,null,null,null,null,"個人番号\n又は法人番号",null,null,null,null,null,null,null,1,null,null,1,null,null,1,null,2,null,null,2,null,2,null,3,null,null,3,null,3,null,4,null,null,4,4,null,4,null,null,null,"電話",null,null,null,"0972-22-0000   内線（　　　　）"]
[]
[]
[]
{"$rows_left_out":49}
{"sheet":"　　","index":3,"n_rows":0,"n_cols":0,"rows_kept":0,"cut":false,"hidden":false,"merged":[]}

{"sheet":"異動届出書（リスト印刷）","index":4,"n_rows":51,"n_cols":94,"rows_kept":51,"cut":false,"hidden":false,"merged":[[47,57,50,74],[47,54,50,56],[47,14,47,53],[1,73,2,79],[1,80,2,91],[38,8,39,45],[37,8,37,9],[37,10,37,45],[38,62,38,90],[47,2,47,9],[47,10,47,13],[41,61,42,74],[41,75,42,91],[40,49,40,50],[36,37,36,60],[37,51,39,60],[40,51,40,60],[41,49,42,50],[40,61,40,74],[41,51,42,60],[23,2,25,7],[0,19,2,53],[3,24,3,25],[3,27,3,53],[47,1,50,1],[44,68,45,91],[44,57,44,67],[44,51,44,56],[45,51,45,56],[18,70,23,82],[18,61,21,69],[23,62,33,68],[36,86,36,90],[36,78,36,85],[37,62,37,64],[37,65,37,90],[36,8,36,24],[36,25,36,30],[44,10,44,13],[45,65,45,67],[44,1,45,1],[46,1,46,57],[45,57,45,64],[45,10,45,13],[44,14,44,50],[45,14,45,50],[44,2,44,9],[45,2,45,9],[23,43,26,46],[23,47,26,47],[13,31,16,38],[18,39,21,39],[18,40,21,42],[18,43,21,46],[15,8,19,30],[20,8,22,30],[23,8,25,30],[13,39,16,46],[13,47,16,53],[17,31,18,38],[17,39,17,46],[13,54,16,60],[13,61,16,69],[13,70,16,82],[34,54,34,60],[17,47,17,53],[26,2,28,7],[29,2,31,7],[32,2,34,7],[28,47,29,53],[26,8,28,30],[29,8,31,30],[32,8,34,30],[15,2,19,7],[20,2,22,7],[27,39,27,46],[27,47,27,53],[30,59,33,60],[18,47,21,47],[18,48,21,50],[28,39,29,46],[18,51,21,53],[23,51,26,53],[22,39,22,46],[22,47,22,53],[0,0,45,0],[3,1,8,11],[3,12,4,13],[3,14,12,15],[3,16,5,23],[9,1,10,8],[9,9,10,11],[11,1,12,11],[11,12,12,13],[10,16,12,23],[5,12,10,13],[6,16,7,23],[8,16,9,23],[13,1,34,1],[13,2,14,7],[13,8,14,30],[37,2,39,7],[10,24,12,26],[10,27,12,29],[10,30,12,31],[40,2,40,7],[36,31,36,36],[40,8,40,45],[0,3,2,18],[5,75,6,91],[7,75,12,91],[10,35,12,36],[10,37,12,38],[10,39,12,41],[3,54,12,55],[3,75,4,91],[10,42,12,43],[10,44,12,45],[10,46,12,48],[10,49,12,49],[10,50,12,51],[10,52,12,53],[4,24,5,53],[6,24,7,53],[6,56,9,59],[6,60,9,74],[10,56,12,59],[10,60,12,74],[8,24,9,53],[3,56,5,59],[3,60,5,74],[10,32,12,34],[48,2,48,5],[48,6,48,9],[48,10,48,53],[30,70,31,71],[30,72,31,82],[13,83,16,91],[17,54,19,60],[17,61,17,69],[17,70,17,82],[17,83,18,91],[19,83,22,91],[20,54,23,54],[20,55,23,58],[20,59,23,60],[23,83,27,91],[24,54,24,60],[25,55,28,58],[25,59,28,60],[26,70,27,82],[24,70,25,71],[24,72,25,82],[25,54,28,54],[28,83,29,91],[28,70,29,82],[17,93,22,94],[28,93,33,94],[23,93,27,94],[43,1,43,57],[35,1,35,91],[36,1,42,1],[36,2,36,7],[40,75,40,91],[41,2,42,7],[37,46,42,48],[41,8,42,45],[37,49,39,50],[19,31,34,38],[23,48,26,50],[30,39,34,46],[30,47,34,53],[30,54,33,54],[30,55,33,58],[30,83,34,91],[32,70,33,82],[34,70,34,82],[29,54,29,60],[23,39,26,39],[23,40,26,42]]}
[null,null,null,"給与支払報告\n特別徴収",null,null,null,null,null,null,null,null,null,null,null,null,null,null,null,"　に係る給与所得者異動届出書"]
[null,null,null,null,null,null,null,null,null,null,null,null,null,null,null,null,null,null,null,null,null,null,null,null,null,null,null,null,null,null,null,null,null,null,null,null,null,null,null,null,null,null,null,null,null,null,null,null,null,null,null,null,null,null,null,null,null,null,null,null,null,null,null,null,null,null,null,null,null,null,null,null,null,"年度",null,null,null,null,null,null,{"$f":"IF(IFERROR(VLOOKUP($CP$18,入力リスト!A:AT,46,FALSE),0)=0,\"\",VLOOKUP($CP$18,入力リスト!A:AT,46,FALSE))","v":""}]
[]
[null,"佐 伯 市 長 様",null,null,null,null,null,null,null,null,null,null,"\n",null,"（特別徴収義務者）",null,"所在地",null,null,null,null,null,null,null,"〒",null,null,null,null,null,null,null,null,null,null,null,null,null,null,null,null,null,null,null,null,null,null,null,null,null,null,null,null,null,"担当者連絡先",null,"所属",null,null,null,null,null,null,null,null,null,null,null,null,null,null,null,null,null,null,"特別徴収義務者指定番号"]
[]
[null,null,null,null,null,null,null,null,null,null,null,null,"給与支払者"]
[null,null,null,null,null,null,null,null,null,null,null,null,null,null,null,null,"フリガナ",null,null,null,null,null,null,null,null,null,null,null,null,null,null,null,null,null,null,null,null,null,null,null,null,null,null,null,null,null,null,null,null,null,null,null,null,null,null,null,"氏名"]
[null,null,null,null,null,null,null,null,null,null,null,null,null,null,null,null,null,null,null,null,null,null,null,null,null,null,null,null,null,null,null,null,null,null,null,null,null,null,null,null,null,null,null,null,null,null,null,null,null,null,null,null,null,null,null,null,null,null,null,null,null,null,null,null,null,null,null,null,null,null,null,null,null,null,null,"〔市受付）"]
[null,null,null,null,null,null,null,null,null,null,null,null,null,null,null,null,"氏名又は名称"]
[null,{"$f":"IF(IFERROR(VLOOKUP($CP$18,入力リスト!A:AT,45,FALSE),0)=0,\"\",VLOOKUP($CP$18,入力リスト!A:AT,45,FALSE))","v":""},null,null,null,null,null,null,null,"提出"]
[null,null,null,null,null,null,null,null,null,null,null,null,null,null,null,null,"個人番号\n又は法人番号",null,null,null,null,null,null,null,null,null,null,null,null,null,null,null,null,null,null,null,null,null,null,null,null,null,null,null,null,null,null,null,null,null,null,null,null,null,null,null,"電話",null,null,null,"内線（　　　　）"]
[]
[]
[null,"給　与　所　得　者","フリガナ",null,null,null,null,null,{"$f":"IF(IFERROR(VLOOKUP($CP$18,入力リスト!A:AT,3,FALSE),0)=0,\"\",VLOOKUP($CP$18,入力リスト!A:AT,3,FALSE))","v":""},null,null,null,null,null,null,null,null,null,null,null,null,null,null,null,null,null,null,null,null,null,null,"(ア)\n特別徴収税額\n(年税額)",null,null,null,null,null,null,null,"(イ)\n徴収済額\n",null,null,null,null,null,null,null,"(ウ)\n未徴収税額\n(ア)－(イ)",null,null,null,null,null,null,"異動年月日",null,null,null,null,null,null,"異動の事由",null,null,null,null,null,null,null,null,"異動後の未徴収税額の徴収方法",null,null,null,null,null,null,null,null,null,null,null,null,"退職時までの\n給与支払額\n(1月1日以降)"]
[]
{"$rows_left_out":37}
{"sheet":"入力リスト","index":5,"n_rows":111,"n_cols":46,"rows_kept":111,"cut":false,"hidden":false,"merged":[[9,42,9,43],[8,23,8,35],[8,45,9,45],[8,36,8,41],[9,36,9,37],[8,44,9,44],[8,42,8,43],[8,0,9,0],[8,1,8,6],[8,9,8,11],[8,12,8,14],[8,18,9,18],[8,19,9,19],[8,15,8,17],[8,20,9,20],[8,21,9,21],[8,22,9,22]]}
[null,"リストデータあり⇒",null,null,null,null,null,null,null,null,null,null,null,null,null,null,null,null,"１ 退職",null,"１ 特別徴収継続\n　→①欄に記入",null,null,null,null,null,null,null,null,null,null,null,null,null,null,"１ 必要",null,null,null,null,null,null,null,null,null,"１ 現年度"]
[null,null,null,null,null,null,null,null,null,null,null,null,null,null,null,null,null,null,"２ 転勤",null,"２ 一括徴収\n　→②欄に記入",null,null,null,null,null,null,null,null,null,null,null,null,null,null,"２ 不要",null,null,null,null,null,null,null,null,null,"２ 新年度"]
[null,null,null,null,null,null,null,null,null,null,null,null,null,null,null,null,null,null,"３ 休職・長欠",null,"３ 普通徴収\n　（本人納付）\n　→③欄に記入",null,null,null,null,null,null,null,null,null,null,null,null,null,null,null,null,null,null,null,null,null,null,null,null,"３ 両年度"]
[null,null,null,null,null,null,null,null,null,null,null,null,null,null,null,null,null,null,"４ 死亡"]
[null,null,null,null,null,null,null,null,null,null,null,null,null,null,null,null,null,null,"５ 支払少額・不定期"]
[null,null,null,null,null,null,null,null,null,null,null,null,null,null,null,null,null,null,"６ 合併・解散"]
[null,null,null,null,null,null,null,null,null,null,null,null,null,null,null,null,null,null,"７ その他"]
[null,2,3,4,5,6,7,8,9,10,11,12,13,14,15,16,17,18,19,20,21,22,23,24,25,26,27,28,29,30,31,32,33,34,35,36,37,38,39,40,41,42,43,44,45,46]
["No","給与所得者",null,null,null,null,null,null,"（ア）","（イ）",null,null,"（ウ）",null,null,"異動年月日",null,null,"異動の事由","異動の事由\n自由記載欄","異動後の未徴収税額の徴収方法","退職時までの\n給与支払額","控除社会\n保険料額","①特別徴収の場合",null,null,null,null,null,null,null,null,null,null,null,null,"② 一括徴収の場合",null,null,null,null,null,"③普通徴収の場合",null,"提出日","対象年度"]
[null,"氏名","フリガナ","生年月日","個人番号","受給者番号","1月1日現在の住所","異動後の住所","年税額","月から","月まで","徴収済額","月から","月まで","未徴収税額","年","月","日",null,null,null,null,null,"名称","フリガナ","電話番号","担当部署","担当者","郵便番号","所在地","指定番号","受給者番号","法人番号","月割額","開始月","納入書","一括徴収の理由（年）",null,"徴収予定月日①","徴収予定額①","徴収月","納期限","普通徴収の理由（年）"]
["例","佐藤　一郎","サトウ　イチロウ","1993-12-25",123456789012,500105,"鶴岡西町１丁目２２３番地","鶴岡西町１丁目２２３番地",120000,6,10,50000,11,5,70000,6,11,1,"２ 転勤",null,"１ 特別徴収継続\n　→①欄に記入",null,null,"佐伯市教育委員会","サイキシキョウイクイインカイ","２２－３１１８","総務課","高橋","８７６－０８５３","中村東町６番９号",90009876,5001055,1234567890123,10000,11,"１ 必要",null,null,null,null,null,null,null,null,"2024-10-01","１ 現年度"]
[1]
[2]
[3]
[4]
{"$rows_left_out":96}