{"text_format":"1","workbook":"xlsx","n_sheets":6,"sheets":["切替届出書（様式）","切替届出書（記載例）","　　","切替届出書（リスト印刷）","入力リスト","選択"],"not_rendered":{"charts":0,"images":0,"macros":1,"external_links":0,"defined_names":3,"comments":0,"pivot_tables":0},"unopened":[],"bounds":{"document_bytes":16777216,"sheet_cells":100000,"rows_first":2000,"rows_last":500,"rows_between":2000,"halvings":0,"cell_chars":16384,"cell_head_chars":4096},"cells_cut":0,"cells_raw":0,"read":"whole","date_system":"1900"}

{"sheet":"切替届出書（様式）","index":0,"n_rows":46,"n_cols":66,"rows_kept":46,"cut":false,"hidden":false,"merged":[[45,1,46,14],[45,37,46,46],[45,47,46,56],[42,61,42,64],[42,65,42,68],[43,15,46,36],[43,47,44,56],[43,57,46,60],[43,61,46,64],[43,65,46,68],[39,38,41,40],[39,41,41,45],[39,47,40,56],[39,57,39,68],[40,1,41,14],[40,57,41,68],[41,47,42,56],[42,1,43,14],[42,37,44,46],[42,57,42,60],[39,1,39,14],[39,15,42,36],[44,1,44,14],[35,47,36,56],[35,57,38,60],[35,61,38,64],[35,65,38,68],[36,1,36,14],[37,1,38,14],[37,37,38,46],[37,47,38,56],[31,57,31,68],[32,1,33,14],[32,57,33,68],[33,47,34,56],[34,1,35,14],[34,37,36,46],[34,57,34,60],[34,61,34,64],[34,65,34,68],[35,15,38,36],[26,1,27,14],[26,37,28,46],[27,15,30,36],[28,1,28,14],[29,1,30,14],[29,37,30,46],[23,1,23,14],[23,15,26,36],[23,38,25,40],[23,41,25,45],[21,1,22,14],[20,1,20,14],[18,1,19,14],[18,37,20,46],[15,15,18,36],[16,1,17,14],[23,57,23,68],[24,1,25,14],[24,57,25,68],[23,47,24,56],[0,1,2,12],[0,13,2,55],[18,57,18,60],[18,61,18,64],[18,65,18,68],[15,57,15,68],[16,57,17,68],[15,1,15,14],[31,38,33,40],[31,41,33,45],[31,1,31,14],[31,15,34,36],[31,47,32,56],[26,65,26,68],[27,47,28,56],[27,57,30,60],[27,61,30,64],[27,65,30,68],[29,47,30,56],[26,57,26,60],[26,61,26,64],[25,47,26,56],[21,37,22,46],[19,15,22,36],[3,13,11,16],[3,1,8,12],[9,1,11,12],[13,1,14,14],[13,15,14,36],[13,37,14,46],[9,23,11,24],[9,25,11,26],[9,27,11,28],[6,23,8,48],[3,23,5,48],[3,17,5,22],[6,17,8,22],[9,17,11,22],[9,37,11,38],[9,39,11,40],[9,41,11,42],[9,43,11,44],[9,45,11,46],[9,47,11,48],[13,47,14,56],[13,57,14,68],[19,57,22,60],[19,61,22,64],[19,65,22,68],[3,49,11,51],[9,29,11,30],[9,31,11,32],[0,56,0,68],[1,56,2,68],[3,56,5,68],[6,56,8,68],[9,56,11,68],[3,52,5,55],[6,52,8,55],[9,52,11,55],[9,33,11,34],[9,35,11,36],[21,47,22,56],[15,41,17,45],[15,38,17,40],[15,47,16,56],[17,47,18,56],[19,47,20,56]]}
[null,"令和 　　 年度",null,null,null,null,null,null,null,null,null,null,null,"市民税・県民税 普通徴収から特別徴収への切替届出書",null,null,null,null,null,null,null,null,null,null,null,null,null,null,null,null,null,null,null,null,null,null,null,null,null,null,null,null,null,null,null,null,null,null,null,null,null,null,null,null,null,null,"特別徴収義務者指定番号"]
[]
[]
[null,"佐 伯 市 長 様\n",null,null,null,null,null,null,null,null,null,null,null,"（特別徴収義務者）\n給与支払者",null,null,null,"住所（居所）\n又は所在地",null,null,null,null,null,null,null,null,null,null,null,null,null,null,null,null,null,null,null,null,null,null,null,null,null,null,null,null,null,null,null,"担当者",null,null,"係"]
[]
[]
[null,null,null,null,null,null,null,null,null,null,null,null,null,null,null,null,null,"氏名又は\n名称",null,null,null,null,null,null,null,null,null,null,null,null,null,null,null,null,null,null,null,null,null,null,null,null,null,null,null,null,null,null,null,null,null,null,"氏名"]
[]
[]
[null,"令和　  年　  月　  日提出",null,null,null,null,null,null,null,null,null,null,null,null,null,null,null,"個人番号\n又は法人番号",null,null,null,null,null,null,null,null,null,null,null,null,null,null,null,null,null,null,null,null,null,null,null,null,null,null,null,null,null,null,null,null,null,null,"電話"]
[]
[]
[]
[null,"氏名・生年月日・受給者番号",null,null,null,null,null,null,null,null,null,null,null,null,null,"住　　　　所",null,null,null,null,null,null,null,null,null,null,null,null,null,null,null,null,null,null,null,null,null,"徴 収 開 始 月",null,null,null,null,null,null,null,null,null,"備考（就職年月日等）",null,null,null,null,null,null,null,null,null,"市　記　入　欄"]
[]
[null,null,null,null,null,null,null,null,null,null,null,null,null,null,null,null,null,null,null,null,null,null,null,null,null,null,null,null,null,null,null,null,null,null,null,null,null,null,null,null,null,"月分から",null,null,null,null,null," 普通徴収　　　　期分",null,null,null,null,null,null,null,null,null,"住民コード"]
[]
[null,null,null,null,null,null,null,null,null,null,null,null,null,null,null,null,null,null,null,null,null,null,null,null,null,null,null,null,null,null,null,null,null,null,null,null,null,null,null,null,null,null,null,null,null,null,null," まで、納付済"]
[null,"Ｔ・Ｓ・Ｈ　　年　　月　　日",null,null,null,null,null,null,null,null,null,null,null,null,null,null,null,null,null,null,null,null,null,null,null,null,null,null,null,null,null,null,null,null,null,null,null,"  令和　　年　　月　　日",null,null,null,null,null,null,null,null,null,null,null,null,null,null,null,null,null,null,null,"入力",null,null,null,"確認①",null,null,null,"確認②"]
[]
[null,"受給者番号"]
[null,null,null,null,null,null,null,null,null,null,null,null,null,null,null,null,null,null,null,null,null,null,null,null,null,null,null,null,null,null,null,null,null,null,null,null,null,"納期分  "]
[]
[null,null,null,null,null,null,null,null,null,null,null,null,null,null,null,null,null,null,null,null,null,null,null,null,null,null,null,null,null,null,null,null,null,null,null,null,null,null,null,null,null,"月分から",null,null,null,null,null," 普通徴収　　　　期分",null,null,null,null,null,null,null,null,null,"住民コード"]
[]
[null,null,null,null,null,null,null,null,null,null,null,null,null,null,null,null,null,null,null,null,null,null,null,null,null,null,null,null,null,null,null,null,null,null,null,null,null,null,null,null,null,null,null,null,null,null,null," まで、納付済"]
[null,"Ｔ・Ｓ・Ｈ　　年　　月　　日",null,null,null,null,null,null,null,null,null,null,null,null,null,null,null,null,null,null,null,null,null,null,null,null,null,null,null,null,null,null,null,null,null,null,null,"  令和　　年　　月　　日",null,null,null,null,null,null,null,null,null,null,null,null,null,null,null,null,null,null,null,"入力",null,null,null,"確認①",null,null,null,"確認②"]
[]
[null,"受給者番号"]
[null,null,null,null,null,null,null,null,null,null,null,null,null,null,null,null,null,null,null,null,null,null,null,null,null,null,null,null,null,null,null,null,null,null,null,null,null,"納期分  "]
{"$rows_left_out":17}
{"sheet":"切替届出書（記載例）","index":1,"n_rows":46,"n_cols":66,"rows_kept":46,"cut":false,"hidden":false,"merged":[[44,1,44,14],[45,1,46,14],[45,37,46,46],[45,47,46,56],[42,37,44,46],[42,57,42,60],[42,61,42,64],[42,65,42,68],[43,15,46,36],[43,47,44,56],[43,57,46,60],[43,61,46,64],[43,65,46,68],[39,1,39,14],[39,15,42,36],[39,38,41,40],[39,41,41,45],[39,47,40,56],[39,57,39,68],[40,1,41,14],[40,57,41,68],[41,47,42,56],[42,1,43,14],[32,57,33,68],[33,47,34,56],[34,1,35,14],[34,37,36,46],[34,57,34,60],[34,61,34,64],[34,65,34,68],[35,15,38,36],[31,1,31,14],[31,15,34,36],[31,38,33,40],[31,41,33,45],[31,47,32,56],[23,57,23,68],[24,1,25,14],[24,57,25,68],[25,47,26,56],[26,1,27,14],[26,37,28,46],[35,47,36,56],[35,57,38,60],[35,61,38,64],[26,57,26,60],[26,61,26,64],[26,65,26,68],[27,15,30,36],[27,47,28,56],[27,57,30,60],[27,61,30,64],[27,65,30,68],[35,65,38,68],[36,1,36,14],[37,1,38,14],[37,37,38,46],[37,47,38,56],[31,57,31,68],[32,1,33,14],[28,1,28,14],[29,1,30,14],[29,37,30,46],[29,47,30,56],[15,1,15,14],[15,15,18,36],[15,38,17,40],[15,41,17,45],[15,47,16,56],[19,47,20,56],[23,1,23,14],[23,15,26,36],[23,38,25,40],[23,41,25,45],[23,47,24,56],[19,57,22,60],[19,61,22,64],[19,65,22,68],[20,1,20,14],[21,1,22,14],[21,37,22,46],[21,47,22,56],[15,57,15,68],[16,1,17,14],[16,57,17,68],[17,47,18,56],[18,1,19,14],[18,37,20,46],[18,57,18,60],[18,61,18,64],[18,65,18,68],[19,15,22,36],[9,52,11,55],[9,56,11,68],[9,29,11,30],[9,31,11,32],[9,33,11,34],[9,35,11,36],[9,37,11,38],[9,39,11,40],[13,1,14,14],[13,15,14,36],[13,37,14,46],[13,47,14,56],[13,57,14,68],[0,1,2,12],[0,13,2,55],[0,56,0,68],[1,56,2,68],[3,1,8,12],[3,13,11,16],[3,17,5,22],[3,23,5,48],[3,49,11,51],[3,52,5,55],[3,56,5,68],[6,17,8,22],[6,23,8,48],[6,52,8,55],[6,56,8,68],[9,1,11,12],[9,17,11,22],[9,23,11,24],[9,25,11,26],[9,27,11,28],[9,41,11,42],[9,43,11,44],[9,45,11,46],[9,47,11,48]]}
[null,"令和　６　年度",null,null,null,null,null,null,null,null,null,null,null,"市民税・県民税 普通徴収から特別徴収への切替届出書",null,null,null,null,null,null,null,null,null,null,null,null,null,null,null,null,null,null,null,null,null,null,null,null,null,null,null,null,null,null,null,null,null,null,null,null,null,null,null,null,null,null,"特別徴収義務者指定番号"]
[null,null,null,null,null,null,null,null,null,null,null,null,null,null,null,null,null,null,null,null,null,null,null,null,null,null,null,null,null,null,null,null,null,null,null,null,null,null,null,null,null,null,null,null,null,null,null,null,null,null,null,null,null,null,null,null,9000111]
[]
[null,"佐 伯 市 長 様\n",null,null,null,null,null,null,null,null,null,null,null,"（特別徴収義務者）\n給与支払者",null,null,null,"住所（居所）\n又は所在地",null,null,null,null,null,"佐伯市中村南町99番1号",null,null,null,null,null,null,null,null,null,null,null,null,null,null,null,null,null,null,null,null,null,null,null,null,null,"担当者",null,null,"係",null,null,null,"総務係"]
[]
[]
[null,null,null,null,null,null,null,null,null,null,null,null,null,null,null,null,null,"氏名又は\n名称",null,null,null,null,null,"株式会社　大分商事",null,null,null,null,null,null,null,null,null,null,null,null,null,null,null,null,null,null,null,null,null,null,null,null,null,null,null,null,"氏名",null,null,null,"上浦　好子"]
[]
[]
[null,"令和 6 年 8 月 19 日提出",null,null,null,null,null,null,null,null,null,null,null,null,null,null,null,"個人番号\n又は法人番号",null,null,null,null,null,8,null,7,null,6,null,5,null,4,null,3,null,2,null,1,null,2,null,3,null,4,null,5,null,6,null,null,null,null,"電話",null,null,null,"0972-22-3111"]
[]
[]
[]
[null,"氏名・生年月日・受給者番号",null,null,null,null,null,null,null,null,null,null,null,null,null,"住　　　　所",null,null,null,null,null,null,null,null,null,null,null,null,null,null,null,null,null,null,null,null,null,"徴 収 開 始 月",null,null,null,null,null,null,null,null,null,"備考（就職年月日等）",null,null,null,null,null,null,null,null,null,"市　記　入　欄"]
[]
[null,"シロヤマ　サブロウ",null,null,null,null,null,null,null,null,null,null,null,null,null,"佐伯市中村南町0番0号",null,null,null,null,null,null,null,null,null,null,null,null,null,null,null,null,null,null,null,null,null,null,9,null,null,"月分から",null,null,null,null,null," 普通徴収　１　期分",null,null,null,null,null,null,null,null,null,"住民コード"]
[null,"城山　三郎"]
[null,null,null,null,null,null,null,null,null,null,null,null,null,null,null,null,null,null,null,null,null,null,null,null,null,null,null,null,null,null,null,null,null,null,null,null,null,null,null,null,null,null,null,null,null,null,null," まで、納付済"]
[null,"Ｔ・Ｓ・Ｈ 60 年 3 月 3 日",null,null,null,null,null,null,null,null,null,null,null,null,null,null,null,null,null,null,null,null,null,null,null,null,null,null,null,null,null,null,null,null,null,null,null,"  令和 6 年 10 月 10 日",null,null,null,null,null,null,null,null,null,null,null,null,null,null,null,null,null,null,null,"入力",null,null,null,"確認①",null,null,null,"確認②"]
[null,null,null,null,null,null,null,null,null,null,null,null,null,null,null,null,null,null,null,null,null,null,null,null,null,null,null,null,null,null,null,null,null,null,null,null,null,null,null,null,null,null,null,null,null,null,null,"令和6年8月2日就職"]
[null,"受給者番号"]
[null,"B-0001",null,null,null,null,null,null,null,null,null,null,null,null,null,null,null,null,null,null,null,null,null,null,null,null,null,null,null,null,null,null,null,null,null,null,null,"納期分  "]
[]
[null,null,null,null,null,null,null,null,null,null,null,null,null,null,null,null,null,null,null,null,null,null,null,null,null,null,null,null,null,null,null,null,null,null,null,null,null,null,null,null,null,"月分から",null,null,null,null,null," 普通徴収　　　　期分",null,null,null,null,null,null,null,null,null,"住民コード"]
[]
[null,null,null,null,null,null,null,null,null,null,null,null,null,null,null,null,null,null,null,null,null,null,null,null,null,null,null,null,null,null,null,null,null,null,null,null,null,null,null,null,null,null,null,null,null,null,null," まで、納付済"]
[null,"Ｔ・Ｓ・Ｈ　　年　　月　　日",null,null,null,null,null,null,null,null,null,null,null,null,null,null,null,null,null,null,null,null,null,null,null,null,null,null,null,null,null,null,null,null,null,null,null,"  令和　　年　　月　　日",null,null,null,null,null,null,null,null,null,null,null,null,null,null,null,null,null,null,null,"入力",null,null,null,"確認①",null,null,null,"確認②"]
[]
[null,"受給者番号"]
[null,null,null,null,null,null,null,null,null,null,null,null,null,null,null,null,null,null,null,null,null,null,null,null,null,null,null,null,null,null,null,null,null,null,null,null,null,"納期分  "]
{"$rows_left_out":17}
{"sheet":"　　","index":2,"n_rows":0,"n_cols":0,"rows_kept":0,"cut":false,"hidden":false,"merged":[]}

{"sheet":"切替届出書（リスト印刷）","index":3,"n_rows":46,"n_cols":85,"rows_kept":46,"cut":false,"hidden":false,"merged":[[0,1,2,12],[0,13,2,55],[0,56,0,68],[1,56,2,68],[3,1,8,12],[3,13,11,16],[3,17,5,22],[3,23,5,48],[3,49,11,51],[3,52,5,55],[9,10,11,12],[9,1,11,9],[3,56,5,68],[6,17,8,22],[6,23,8,48],[6,52,8,55],[6,56,8,68],[9,17,11,22],[9,23,11,24],[9,25,11,26],[9,27,11,28],[9,41,11,42],[9,43,11,44],[9,45,11,46],[9,47,11,48],[9,52,11,55],[9,56,11,68],[9,29,11,30],[9,31,11,32],[9,33,11,34],[9,35,11,36],[9,37,11,38],[9,39,11,40],[13,1,14,14],[13,15,14,36],[13,37,14,46],[13,47,14,56],[13,57,14,68],[15,1,15,14],[15,15,18,36],[15,38,17,40],[15,41,17,45],[15,47,16,56],[19,57,22,60],[19,61,22,64],[19,65,22,68],[20,1,20,14],[21,1,22,14],[21,37,22,46],[15,57,15,68],[16,1,17,14],[16,57,17,68],[17,47,18,56],[18,1,19,14],[18,37,20,46],[18,57,18,60],[18,61,18,64],[18,65,18,68],[19,15,22,36],[19,47,22,56],[23,1,23,14],[23,15,26,36],[23,38,25,40],[23,41,25,45],[23,47,24,56],[23,57,23,68],[24,1,25,14],[24,57,25,68],[25,47,26,56],[26,1,27,14],[27,47,30,56],[28,1,28,14],[29,1,30,14],[29,37,30,46],[31,1,31,14],[31,15,34,36],[31,38,33,40],[31,41,33,45],[31,47,32,56],[26,37,28,46],[31,57,31,68],[32,1,33,14],[32,57,33,68],[33,47,34,56],[34,1,35,14],[34,37,36,46],[34,57,34,60],[34,61,34,64],[34,65,34,68],[35,15,38,36],[35,47,38,56],[26,57,26,60],[26,61,26,64],[26,65,26,68],[27,15,30,36],[27,57,30,60],[27,61,30,64],[27,65,30,68],[41,47,42,56],[42,1,43,14],[35,57,38,60],[35,61,38,64],[35,65,38,68],[36,1,36,14],[37,1,38,14],[37,37,38,46],[43,47,46,56],[17,84,19,89],[24,78,26,83],[24,84,26,89],[20,78,23,89],[44,1,44,14],[45,1,46,14],[45,37,46,46],[17,78,19,83],[42,37,44,46],[42,57,42,60],[42,61,42,64],[42,65,42,68],[43,15,46,36],[43,57,46,60],[43,61,46,64],[43,65,46,68],[39,1,39,14],[39,15,42,36],[39,38,41,40],[39,41,41,45],[39,47,40,56],[39,57,39,68],[40,1,41,14],[40,57,41,68]]}
[null,{"$f":"\"令和 \"&IF(IFERROR(VLOOKUP(CG18,入力リスト!A:O,8,FALSE),0)=0,\"\",VLOOKUP(CG18,入力リスト!A:O,8,FALSE))&\" 年度\"","v":"令和  年度"},null,null,null,null,null,null,null,null,null,null,null,"市民税・県民税 普通徴収から特別徴収への切替届出書",null,null,null,null,null,null,null,null,null,null,null,null,null,null,null,null,null,null,null,null,null,null,null,null,null,null,null,null,null,null,null,null,null,null,null,null,null,null,null,null,null,null,"特別徴収義務者指定番号"]
[]
[]
[null,"佐 伯 市 長 様\n",null,null,null,null,null,null,null,null,null,null,null,"（特別徴収義務者）\n給与支払者",null,null,null,"住所（居所）\n又は所在地",null,null,null,null,null,null,null,null,null,null,null,null,null,null,null,null,null,null,null,null,null,null,null,null,null,null,null,null,null,null,null,"担当者",null,null,"係"]
[]
[]
[null,null,null,null,null,null,null,null,null,null,null,null,null,null,null,null,null,"氏名又は\n名称",null,null,null,null,null,null,null,null,null,null,null,null,null,null,null,null,null,null,null,null,null,null,null,null,null,null,null,null,null,null,null,null,null,null,"氏名"]
[]
[]
[null,{"$f":"IF(IFERROR(VLOOKUP($CG$18,入力リスト!A:O,15,FALSE),0)=0,\"\",VLOOKUP($CG$18,入力リスト!A:O,15,FALSE))","v":""},null,null,null,null,null,null,null,null,"提出",null,null,null,null,null,null,"個人番号\n又は法人番号",null,null,null,null,null,null,null,null,null,null,null,null,null,null,null,null,null,null,null,null,null,null,null,null,null,null,null,null,null,null,null,null,null,null,"電話"]
[]
[]
[]
[null,"氏名・生年月日・受給者番号",null,null,null,null,null,null,null,null,null,null,null,null,null,"住　　　　所",null,null,null,null,null,null,null,null,null,null,null,null,null,null,null,null,null,null,null,null,null,"徴 収 開 始 月",null,null,null,null,null,null,null,null,null,"備考（就職年月日等）",null,null,null,null,null,null,null,null,null,"市　記　入　欄"]
[]
[null,{"$f":"IF($CG$18>$CG$25,\"\",IF(IFERROR(VLOOKUP($CG$18,入力リスト!A:O,3,FALSE),0)=0,\"\",VLOOKUP($CG$18,入力リスト!A:O,3,FALSE)))","v":""},null,null,null,null,null,null,null,null,null,null,null,null,null,{"$f":"IF($CG$18>$CG$25,\"\",IF(IFERROR(VLOOKUP($CG$18,入力リスト!A:O,6,FALSE),0)=0,\"\",VLOOKUP($CG$18,入力リスト!A:O,6,FALSE)))","v":""},null,null,null,null,null,null,null,null,null,null,null,null,null,null,null,null,null,null,null,null,null,null,{"$f":"IF($CG$18>$CG$25,\"\",IF(IFERROR(VLOOKUP($CG$18,入力リスト!A:O,9,FALSE),0)=0,\"\",VLOOKUP($CG$18,入力リスト!A:O,9,FALSE)))","v":""},null,null,"月分から",null,null,null,null,null,{"$f":"IF($CG$18>$CG$25,\"\",IF(IFERROR(VLOOKUP($CG$18,入力リスト!A:O,13,FALSE),0)=0,\"\",VLOOKUP($CG$18,入力リスト!A:O,13,FALSE)))","v":""},null,null,null,null,null,null,null,null,null,"住民コード"]
[null,{"$f":"IF($CG$18>$CG$25,\"\",IF(IFERROR(VLOOKUP($CG$18,入力リスト!A:O,2,FALSE),0)=0,\"\",VLOOKUP($CG$18,入力リスト!A:O,2,FALSE)))","v":""}]
[null,null,null,null,null,null,null,null,null,null,null,null,null,null,null,null,null,null,null,null,null,null,null,null,null,null,null,null,null,null,null,null,null,null,null,null,null,null,null,null,null,null,null,null,null,null,null," まで、納付済",null,null,null,null,null,null,null,null,null,null,null,null,null,null,null,null,null,null,null,null,null,null,null,null,null,null,null,null,null,null,"No.",null,null,null,null,null,1]
[null,{"$f":"IF($CG$18>$CG$25,\"\",IF(IFERROR(VLOOKUP($CG$18,入力リスト!A:O,5,FALSE),0)=0,\"\",VLOOKUP($CG$18,入力リスト!A:O,5,FALSE)))","v":""},null,null,null,null,null,null,null,null,null,null,null,null,null,null,null,null,null,null,null,null,null,null,null,null,null,null,null,null,null,null,null,null,null,null,null,{"$f":"IF($CG$18>$CG$25,\"\",IF(IFERROR(VLOOKUP($CG$18,入力リスト!A:O,10,FALSE),0)=0,\"\",TEXT(VLOOKUP($CG$18,入力リスト!A:O,10,FALSE),\"GGGe年m月d日\")))","v":""},null,null,null,null,null,null,null,null,null,null,null,null,null,null,null,null,null,null,null,"入力",null,null,null,"確認①",null,null,null,"確認②"]
[null,null,null,null,null,null,null,null,null,null,null,null,null,null,null,{"$f":"IF($CG$18>$CG$25,\"\",IF(IFERROR(VLOOKUP($CG$18,入力リスト!A:O,7,FALSE),0)=0,\"\",VLOOKUP($CG$18,入力リスト!A:O,7,FALSE)))","v":""},null,null,null,null,null,null,null,null,null,null,null,null,null,null,null,null,null,null,null,null,null,null,null,null,null,null,null,null,null,null,null,{"$f":"IF($CG$18>$CG$25,\"\",IF(IFERROR(VLOOKUP($CG$18,入力リスト!A:O,14,FALSE),0)=0,\"\",VLOOKUP($CG$18,入力リスト!A:O,14,FALSE)))","v":""}]
[null,"受給者番号",null,null,null,null,null,null,null,null,null,null,null,null,null,null,null,null,null,null,null,null,null,null,null,null,null,null,null,null,null,null,null,null,null,null,null,null,null,null,null,null,null,null,null,null,null,null,null,null,null,null,null,null,null,null,null,null,null,null,null,null,null,null,null,null,null,null,null,null,null,null,null,null,null,null,null,null,"～"]
[null,{"$f":"IF($CG$18>$CG$25,\"\",IF(IFERROR(VLOOKUP($CG$18,入力リスト!A:O,4,FALSE),0)=0,\"\",VLOOKUP($CG$18,入力リスト!A:O,4,FALSE)))","v":""},null,null,null,null,null,null,null,null,null,null,null,null,null,null,null,null,null,null,null,null,null,null,null,null,null,null,null,null,null,null,null,null,null,null,null,"納期分  "]
[]
[null,{"$f":"IF($CG$18+1>$CG$25,\"\",IF(IFERROR(VLOOKUP($CG$18+1,入力リスト!A:O,3,FALSE),0)=0,\"\",VLOOKUP($CG$18+1,入力リスト!A:O,3,FALSE)))","v":""},null,null,null,null,null,null,null,null,null,null,null,null,null,{"$f":"IF($CG$18+1>$CG$25,\"\",IF(IFERROR(VLOOKUP($CG$18+1,入力リスト!A:O,6,FALSE),0)=0,\"\",VLOOKUP($CG$18+1,入力リスト!A:O,6,FALSE)))","v":""},null,null,null,null,null,null,null,null,null,null,null,null,null,null,null,null,null,null,null,null,null,null,{"$f":"IF($CG$18+1>$CG$25,\"\",IF(IFERROR(VLOOKUP($CG$18+1,入力リスト!A:O,9,FALSE),0)=0,\"\",VLOOKUP($CG$18+1,入力リスト!A:O,9,FALSE)))","v":""},null,null,"月分から",null,null,null,null,null,{"$f":"IF($CG$18+1>$CG$25,\"\",IF(IFERROR(VLOOKUP($CG$18+1,入力リスト!A:O,13,FALSE),0)=0,\"\",VLOOKUP($CG$18+1,入力リスト!A:O,13,FALSE)))","v":""},null,null,null,null,null,null,null,null,null,"住民コード"]
[null,{"$f":"IF($CG$18+1>$CG$25,\"\",IF(IFERROR(VLOOKUP($CG$18+1,入力リスト!A:O,2,FALSE),0)=0,\"\",VLOOKUP($CG$18+1,入力リスト!A:O,2,FALSE)))","v":""},null,null,null,null,null,null,null,null,null,null,null,null,null,null,null,null,null,null,null,null,null,null,null,null,null,null,null,null,null,null,null,null,null,null,null,null,null,null,null,null,null,null,null,null,null,null,null,null,null,null,null,null,null,null,null,null,null,null,null,null,null,null,null,null,null,null,null,null,null,null,null,null,null,null,null,null,"No.",null,null,null,null,null,1]
[null,null,null,null,null,null,null,null,null,null,null,null,null,null,null,null,null,null,null,null,null,null,null,null,null,null,null,null,null,null,null,null,null,null,null,null,null,null,null,null,null,null,null,null,null,null,null," まで、納付済"]
[null,{"$f":"IF($CG$18+1>$CG$25,\"\",IF(IFERROR(VLOOKUP($CG$18+1,入力リスト!A:O,5,FALSE),0)=0,\"\",VLOOKUP($CG$18+1,入力リスト!A:O,5,FALSE)))","v":""},null,null,null,null,null,null,null,null,null,null,null,null,null,null,null,null,null,null,null,null,null,null,null,null,null,null,null,null,null,null,null,null,null,null,null,{"$f":"IF($CG$18+1>$CG$25,\"\",IF(IFERROR(VLOOKUP($CG$18+1,入力リスト!A:O,10,FALSE),0)=0,\"\",TEXT(VLOOKUP($CG$18+1,入力リスト!A:O,10,FALSE),\"GGGe年m月d日\")))","v":""},null,null,null,null,null,null,null,null,null,null,null,null,null,null,null,null,null,null,null,"入力",null,null,null,"確認①",null,null,null,"確認②"]
[null,null,null,null,null,null,null,null,null,null,null,null,null,null,null,{"$f":"IF($CG$18+1>$CG$25,\"\",IF(IFERROR(VLOOKUP($CG$18+1,入力リスト!A:O,7,FALSE),0)=0,\"\",VLOOKUP($CG$18+1,入力リスト!A:O,7,FALSE)))","v":""},null,null,null,null,null,null,null,null,null,null,null,null,null,null,null,null,null,null,null,null,null,null,null,null,null,null,null,null,null,null,null,{"$f":"IF($CG$18+1>$CG$25,\"\",IF(IFERROR(VLOOKUP($CG$18+1,入力リスト!A:O,14,FALSE),0)=0,\"\",VLOOKUP($CG$18+1,入力リスト!A:O,14,FALSE)))","v":""}]
[null,"受給者番号"]
[null,{"$f":"IF($CG$18+1>$CG$25,\"\",IF(IFERROR(VLOOKUP($CG$18+1,入力リスト!A:O,4,FALSE),0)=0,\"\",VLOOKUP($CG$18+1,入力リスト!A:O,4,FALSE)))","v":""},null,null,null,null,null,null,null,null,null,null,null,null,null,null,null,null,null,null,null,null,null,null,null,null,null,null,null,null,null,null,null,null,null,null,null,"納期分  "]
{"$rows_left_out":17}
{"sheet":"入力リスト","index":4,"n_rows":104,"n_cols":15,"rows_kept":104,"cut":false,"hidden":false,"merged":[[99,9,99,11],[100,9,100,11],[101,9,101,11],[102,9,102,11],[103,9,103,11],[94,9,94,11],[95,9,95,11],[96,9,96,11],[97,9,97,11],[98,9,98,11],[89,9,89,11],[90,9,90,11],[91,9,91,11],[92,9,92,11],[93,9,93,11],[84,9,84,11],[85,9,85,11],[86,9,86,11],[87,9,87,11],[88,9,88,11],[79,9,79,11],[80,9,80,11],[81,9,81,11],[82,9,82,11],[83,9,83,11],[74,9,74,11],[75,9,75,11],[76,9,76,11],[77,9,77,11],[78,9,78,11],[69,9,69,11],[70,9,70,11],[71,9,71,11],[72,9,72,11],[73,9,73,11],[64,9,64,11],[65,9,65,11],[66,9,66,11],[67,9,67,11],[68,9,68,11],[59,9,59,11],[60,9,60,11],[61,9,61,11],[62,9,62,11],[63,9,63,11],[54,9,54,11],[55,9,55,11],[56,9,56,11],[57,9,57,11],[58,9,58,11],[49,9,49,11],[50,9,50,11],[51,9,51,11],[52,9,52,11],[53,9,53,11],[44,9,44,11],[45,9,45,11],[46,9,46,11],[47,9,47,11],[48,9,48,11],[39,9,39,11],[40,9,40,11],[41,9,41,11],[42,9,42,11],[43,9,43,11],[34,9,34,11],[35,9,35,11],[36,9,36,11],[37,9,37,11],[38,9,38,11],[30,9,30,11],[31,9,31,11],[32,9,32,11],[33,9,33,11],[24,9,24,11],[25,9,25,11],[26,9,26,11],[27,9,27,11],[28,9,28,11],[21,9,21,11],[22,9,22,11],[23,9,23,11],[14,9,14,11],[15,9,15,11],[16,9,16,11],[17,9,17,11],[18,9,18,11],[29,9,29,11],[12,9,12,11],[13,9,13,11],[4,9,4,11],[5,9,5,11],[6,9,6,11],[7,9,7,11],[8,9,8,11],[19,9,19,11],[20,9,20,11],[1,14,2,14],[1,0,2,0],[1,1,1,6],[1,7,1,8],[1,12,2,13],[1,9,2,11],[9,9,9,11],[10,9,10,11],[11,9,11,11],[3,9,3,11]]}
[null,2,null,null,3,null,4,5,6,"1900-01-07","1900-01-08","1900-01-09",10,null,11]
["No","給与所得者",null,null,null,null,null,"徴収開始月",null,"納期限",null,null,"備考",null,"提出日"]
[null,"氏名","フリガナ","受給者番号","生年月日","住所","方書","年度","月分"]
["例","城山　三郎","シロヤマ　サブロウ","B-0001","1985-03-03","佐伯市中村南町0番0号",null,6,9,"2024-10-10",null,null,"普通徴収１期分","令和6年8月2日就職","2024-08-19"]
[1]
[2]
[3]
[4]
[5]
[6]
[7]
[8]
[9]
[10]
[11]
[12]
[13]
[14]
[15]
[16]
[17]
[18]
[19]
[20]
[21]
[22]
[23]
[24]
[25]
[26]
{"$rows_left_out":75}
{"sheet":"選択","index":5,"n_rows":4,"n_cols":1,"rows_kept":4,"cut":false,"hidden":true,"merged":[]}
["普通徴収１期分"]
["普通徴収２期分"]
["普通徴収３期分"]
["普通徴収４期分"]